BDBM50533632 CHEMBL4574891
SMILES CCCCNc1cc(nc(N)n1)-c1ccccc1
InChI Key InChIKey=SPFCBZYRAAVAJV-UHFFFAOYSA-N
Data  1 EC50
  Tab Delimited (TSV)   2D SDfile   Computed 3D by Vconf -m prep SDfile
Find this compound or compounds like it in BindingDB:
Activity Spreadsheet -- Enzyme Inhibition Constant Data from BindingDB
Found 1 hit for monomerid = 50533632
TargetToll-like receptor 8(Homo sapiens (Human))
University Of Minnesota
Curated by ChEMBL
LigandPNGBDBM50533632(CHEMBL4574891)
Affinity DataEC50:  6.70E+3nM. Assay description: Agonist activity at human TLR8 expressed in HEK293 cells assessed as induction of NF-kappaB activity by secreted alkaline phosphatase reporter gene a...
In DepthDetails ArticlePubMed